{"text_format":"1","workbook":"xlsx","n_sheets":3,"sheets":["Orig. ","Predominant Use-MultLoc","Local Tax Rate-Hide"],"not_rendered":{"charts":0,"images":0,"macros":0,"external_links":1,"defined_names":2,"comments":0,"pivot_tables":1},"unopened":[],"bounds":{"document_bytes":16777216,"sheet_cells":100000,"rows_first":2000,"rows_last":500,"rows_between":2000,"halvings":0,"cell_chars":16384,"cell_head_chars":4096},"cells_cut":0,"cells_raw":0,"read":"whole","date_system":"1900"}

{"sheet":"Orig. ","index":0,"n_rows":33,"n_cols":15,"rows_kept":33,"cut":false,"hidden":true,"merged":[[32,0,32,14],[29,0,29,2],[29,3,29,8],[29,9,29,14],[30,0,30,2],[30,3,30,8],[30,9,30,14],[31,0,31,5],[31,6,31,8],[31,9,31,12],[31,13,31,14],[23,5,23,6],[23,7,23,13],[26,0,26,2],[26,3,26,8],[26,9,26,14],[24,0,24,14],[25,0,25,14],[27,0,27,2],[27,3,27,8],[27,9,27,14],[28,9,28,14],[28,0,28,2],[28,3,28,8],[21,2,21,4],[21,5,21,6],[21,7,21,9],[21,10,21,12],[22,2,22,4],[22,5,22,6],[22,7,22,9],[22,10,22,12],[19,10,19,12],[20,2,20,4],[20,5,20,6],[20,7,20,9],[20,10,20,12],[8,12,8,14],[10,12,10,14],[10,0,10,11],[13,2,13,4],[13,5,13,6],[13,7,13,9],[13,10,13,12],[9,7,9,10],[8,7,8,10],[9,0,9,6],[9,12,9,14],[5,0,5,3],[2,4,2,7],[3,4,3,7],[4,4,4,7],[5,4,5,7],[0,0,0,14],[1,0,1,14],[2,0,2,3],[3,0,3,3],[4,0,4,3],[14,2,14,4],[14,5,14,6],[14,7,14,9],[14,10,14,12],[15,2,15,4],[15,5,15,6],[15,7,15,9],[15,10,15,12],[16,2,16,4],[16,5,16,6],[16,7,16,9],[16,10,16,12],[23,2,23,4],[17,2,17,4],[17,5,17,6],[17,7,17,9],[17,10,17,12],[18,2,18,4],[18,5,18,6],[18,7,18,9],[18,10,18,12],[19,2,19,4],[19,5,19,6],[19,7,19,9]]}
["Use this worksheet to calculate state and local real estate excise tax (REET) per county, when the sale includes parcels in two or more location codes. Include all the parcels within the entire transaction on this worksheet.\n\nONLY use this worksheet if the predominant use for the sale is agriculture or timber land. For assistance in determining predominant use, see ETA 3215.2019 - Graduated Real Estate Excise Tax (REET): Land Classifications & Predominant Use.  If the transfer involves multiple parcels with different classifications, the Predominate Use worksheet must be completed first."]
["Step 1: Calculate the taxable selling price for entire transaction"]
["Gross Selling Price",null,null,null,0]
["Personal Property (deduct)",null,null,null,0]
["Exemption Claimed (deduct)",null,null,null,0]
["Total Taxable Selling Price (A)",null,null,null,{"$f":"IF((E3-E4-E5)<0, \"ERROR\",(E3-E4-E5))","v":0}]
["Step 2: Calculate the total state REET tax"]
["Amount * Rate = Tax due"]
[null,null,null,null,null,null,null,"Amount",null,null,null,"Rate","Tax Due"]
["Taxable sale price",null,null,null,null,null,null,{"$f":"IF(E6=0,\" \",(IF(E6<500000.01, E6,500000)))","v":" "},null,null,null,1.2800000000000001E-2,{"$f":"IF(H10=\" \",\" \",(H10*L10))","v":" "}]
["Total State REET Tax (B)",null,null,null,null,null,null,null,null,null,null,null,{"$f":"SUM(M10:O10)","v":0}]
["Step 3: Calculate the state REET tax and local REET tax per parcel"]
["Begin by listing the parcel number and taxable selling price for each. Then fill out the table from left to right for each parcel."]
["Parcel number","Taxable Selling\nPrice for this\nParcel\n\n(C)","Percentage of Sale for this Parcel\n\n(D)\n\nDivide the taxable selling price per parcel by the total taxable selling price\n\nC / A",null,null,"State REET Tax\n\nMultiply the total state REET by the percentage of sale for this parcel\n\n\n\n\nB * D",null,"Location\nCode",null,null,"County Where Parcel is Located",null,null,"Local Rate\n\n(E)","Local REET Tax\n\n\n\n\n\n\n\n\n\nC * E"]
[null,null,{"$f":"IF($E$6=0,\" \",IF(B15=\" \", \" \",B15/$E$6))","v":" "},null,null,null,null,null,null,null,null,null,null,null,{"$f":"B15*N15","v":0}]
[null,null,{"$f":"IF($E$6=0,\" \",IF(B16=\" \", \" \",B16/$E$6))","v":" "},null,null,{"$f":"IF(B16>0,C16*$M$11,\" \")","v":" "},null,null,null,null,null,null,null,null,{"$f":"B16*N16","v":0}]
[null,null," ",null,null," ",null,null,null,null,null,null,null,null,0]
[null,null," ",null,null," ",null,null,null,null,null,null,null,null,0]
[null,null," ",null,null," ",null,null,null,null,null,null,null,null,0]
[null,null," ",null,null," ",null,null,null,null,null,null,null,null,0]
[null,null," ",null,null," ",null,null,null,null,null,null,null,null,0]
[null,null," ",null,null," ",null,null,null,null,null,null,null,null,0]
[null,null," ",null,null," ",null,null,null,null,null,null,null,null,0]
[null,"Total Taxable Selling Price (Must match \"A\" above)","Total state REET tax",null,null,{"$f":"SUM(F15:G23)","v":0},null,"Total local REET tax",null,null,null,null,null,null,{"$f":"SUM(O15:O23)","v":0}]
["Step 4: Calculate the state REET tax and local REET tax per county"]
["Sumbit one affidavit per county using the state and local amounts determined below. Enter these amounts in section 7 of the affidavits."]
["County Name",null,null,"State REET\nAdd the state REET amounts from the\nstate REET tax column above for all the locations within the county",null,null,null,null,null,"Local REET\nAdd the local REET amounts from the\nlocal REET tax column above for all the\nlocations within the county"]
[]
[]
[]
[]
["Total State REET Tax",null,null,null,null,null,{"$f":"SUM(D28:I31)","v":0},null,null,"Total Local REET Tax",null,null,null,{"$f":"SUM(J28:O31)","v":0}]
["For tax assistance, contact your local County Treasurer/Recorder or visit http://dor.wa.gov or call 360-534-1503. To request this document in an alternate format, please call 360-705-6705. Teletype (TTY) users may use the Washington Relay Service by calling 711."]

{"sheet":"Predominant Use-MultLoc","index":1,"n_rows":124,"n_cols":15,"rows_kept":124,"cut":false,"hidden":false,"merged":[[113,5,113,6],[20,2,20,4],[20,5,20,6],[20,7,20,9],[20,10,20,12],[115,0,115,14],[116,0,116,14],[117,0,117,2],[113,7,113,9],[113,10,113,12],[114,2,114,4],[114,5,114,6],[114,7,114,13],[25,2,25,4],[24,2,24,4],[24,5,24,6],[24,7,24,9],[24,10,24,12],[25,5,25,6],[25,7,25,9],[25,10,25,12],[26,2,26,4],[26,5,26,6],[26,7,26,9],[119,0,119,2],[119,3,119,8],[119,9,119,14],[120,0,120,2],[120,3,120,8],[120,9,120,14],[123,0,123,14],[15,2,15,4],[15,5,15,6],[15,7,15,9],[15,10,15,12],[122,0,122,5],[122,6,122,8],[122,9,122,12],[122,13,122,14],[117,3,117,8],[117,9,117,14],[118,0,118,2],[118,3,118,8],[121,0,121,2],[121,3,121,8],[121,9,121,14],[118,9,118,14],[113,2,113,4],[26,10,26,12],[21,2,21,4],[21,5,21,6],[21,7,21,9],[21,10,21,12],[22,2,22,4],[22,5,22,6],[22,7,22,9],[22,10,22,12],[23,2,23,4],[23,5,23,6],[23,7,23,9],[23,10,23,12],[14,2,14,4],[14,5,14,6],[14,7,14,9],[14,10,14,12],[9,0,9,6],[9,7,9,10],[9,12,9,14],[10,0,10,11],[10,12,10,14],[13,10,13,12],[13,7,13,9],[13,5,13,6],[13,2,13,4],[8,12,8,14],[0,0,0,14],[1,0,1,14],[2,0,2,3],[2,4,2,7],[3,0,3,3],[3,4,3,7],[4,0,4,3],[4,4,4,7],[5,0,5,3],[5,4,5,7],[8,7,8,10],[39,7,39,9],[40,7,40,9],[41,7,41,9],[32,7,32,9],[33,7,33,9],[34,7,34,9],[35,7,35,9],[36,7,36,9],[27,7,27,9],[28,7,28,9],[29,7,29,9],[30,7,30,9],[31,7,31,9],[54,7,54,9],[55,7,55,9],[56,7,56,9],[47,7,47,9],[48,7,48,9],[49,7,49,9],[50,7,50,9],[51,7,51,9],[42,7,42,9],[43,7,43,9],[44,7,44,9],[45,7,45,9],[46,7,46,9],[69,7,69,9],[70,7,70,9],[71,7,71,9],[62,7,62,9],[63,7,63,9],[64,7,64,9],[65,7,65,9],[66,7,66,9],[57,7,57,9],[58,7,58,9],[59,7,59,9],[60,7,60,9],[61,7,61,9],[85,7,85,9],[86,7,86,9],[77,7,77,9],[78,7,78,9],[79,7,79,9],[80,7,80,9],[81,7,81,9],[72,7,72,9],[73,7,73,9],[74,7,74,9],[75,7,75,9],[76,7,76,9],[92,7,92,9],[93,7,93,9],[94,7,94,9],[95,7,95,9],[96,7,96,9],[87,7,87,9],[88,7,88,9],[89,7,89,9],[90,7,90,9],[91,7,91,9],[109,7,109,9],[110,7,110,9],[111,7,111,9],[102,7,102,9],[103,7,103,9],[104,7,104,9],[105,7,105,9],[106,7,106,9],[97,7,97,9],[98,7,98,9],[99,7,99,9],[100,7,100,9],[101,7,101,9],[94,2,94,4],[94,5,94,6],[94,10,94,12],[95,2,95,4],[95,5,95,6],[95,10,95,12],[112,7,112,9],[89,2,89,4],[89,5,89,6],[89,10,89,12],[90,2,90,4],[90,5,90,6],[90,10,90,12],[91,2,91,4],[91,5,91,6],[91,10,91,12],[92,2,92,4],[92,5,92,6],[92,10,92,12],[93,2,93,4],[93,5,93,6],[93,10,93,12],[107,7,107,9],[108,7,108,9],[98,2,98,4],[98,5,98,6],[98,10,98,12],[99,2,99,4],[99,5,99,6],[99,10,99,12],[96,2,96,4],[96,5,96,6],[96,10,96,12],[97,2,97,4],[97,5,97,6],[97,10,97,12],[102,2,102,4],[102,5,102,6],[102,10,102,12],[103,2,103,4],[103,5,103,6],[103,10,103,12],[100,2,100,4],[100,5,100,6],[100,10,100,12],[101,2,101,4],[101,5,101,6],[101,10,101,12],[106,2,106,4],[106,5,106,6],[106,10,106,12],[107,2,107,4],[107,5,107,6],[107,10,107,12],[104,2,104,4],[104,5,104,6],[104,10,104,12],[105,2,105,4],[105,5,105,6],[105,10,105,12],[88,2,88,4],[88,5,88,6],[88,10,88,12],[85,5,85,6],[85,10,85,12],[86,2,86,4],[86,5,86,6],[86,10,86,12],[112,2,112,4],[112,5,112,6],[112,10,112,12],[85,2,85,4],[110,2,110,4],[110,5,110,6],[110,10,110,12],[111,2,111,4],[111,5,111,6],[111,10,111,12],[108,2,108,4],[108,5,108,6],[108,10,108,12],[109,2,109,4],[109,5,109,6],[109,10,109,12],[70,2,70,4],[70,5,70,6],[70,10,70,12],[71,2,71,4],[71,5,71,6],[71,10,71,12],[87,2,87,4],[87,5,87,6],[87,10,87,12],[81,2,81,4],[81,5,81,6],[81,10,81,12],[82,2,82,4],[82,5,82,6],[82,10,82,12],[83,2,83,4],[83,5,83,6],[83,10,83,12],[84,2,84,4],[84,5,84,6],[84,10,84,12],[82,7,82,9],[83,7,83,9],[84,7,84,9],[74,2,74,4],[74,5,74,6],[74,10,74,12],[75,2,75,4],[75,5,75,6],[75,10,75,12],[72,2,72,4],[72,5,72,6],[72,10,72,12],[73,2,73,4],[73,5,73,6],[73,10,73,12],[79,2,79,4],[79,5,79,6],[79,10,79,12],[76,2,76,4],[76,5,76,6],[76,10,76,12],[77,2,77,4],[77,5,77,6],[77,10,77,12],[59,5,59,6],[59,10,59,12],[60,2,60,4],[60,5,60,6],[60,10,60,12],[80,2,80,4],[80,5,80,6],[80,10,80,12],[55,2,55,4],[55,5,55,6],[55,10,55,12],[56,2,56,4],[56,5,56,6],[56,10,56,12],[57,2,57,4],[57,5,57,6],[57,10,57,12],[58,2,58,4],[58,5,58,6],[58,10,58,12],[59,2,59,4],[78,2,78,4],[78,5,78,6],[78,10,78,12],[63,2,63,4],[63,5,63,6],[63,10,63,12],[64,2,64,4],[64,5,64,6],[64,10,64,12],[61,2,61,4],[61,5,61,6],[61,10,61,12],[62,2,62,4],[62,5,62,6],[62,10,62,12],[68,2,68,4],[68,5,68,6],[68,10,68,12],[65,2,65,4],[65,5,65,6],[65,10,65,12],[66,2,66,4],[66,5,66,6],[66,10,66,12],[67,7,67,9],[68,7,68,9],[44,5,44,6],[44,10,44,12],[45,2,45,4],[45,5,45,6],[45,10,45,12],[69,2,69,4],[69,5,69,6],[69,10,69,12],[40,2,40,4],[40,5,40,6],[40,10,40,12],[41,2,41,4],[41,5,41,6],[41,10,41,12],[42,2,42,4],[42,5,42,6],[42,10,42,12],[43,2,43,4],[43,5,43,6],[43,10,43,12],[44,2,44,4],[67,2,67,4],[67,5,67,6],[67,10,67,12],[48,2,48,4],[48,5,48,6],[48,10,48,12],[49,2,49,4],[49,5,49,6],[49,10,49,12],[46,2,46,4],[46,5,46,6],[46,10,46,12],[47,2,47,4],[47,5,47,6],[47,10,47,12],[53,2,53,4],[53,5,53,6],[53,10,53,12],[50,2,50,4],[50,5,50,6],[50,10,50,12],[51,2,51,4],[51,5,51,6],[51,10,51,12],[52,7,52,9],[53,7,53,9],[31,5,31,6],[31,10,31,12],[32,2,32,4],[32,5,32,6],[32,10,32,12],[54,2,54,4],[54,5,54,6],[54,10,54,12],[27,2,27,4],[27,5,27,6],[27,10,27,12],[28,2,28,4],[28,5,28,6],[28,10,28,12],[29,2,29,4],[29,5,29,6],[29,10,29,12],[30,2,30,4],[30,5,30,6],[30,10,30,12],[31,2,31,4],[52,2,52,4],[52,5,52,6],[52,10,52,12],[38,10,38,12],[35,2,35,4],[35,5,35,6],[35,10,35,12],[36,2,36,4],[36,5,36,6],[36,10,36,12],[33,2,33,4],[33,5,33,6],[33,10,33,12],[34,2,34,4],[34,5,34,6],[34,10,34,12],[37,7,37,9],[38,7,38,9],[19,5,19,6],[19,7,19,9],[19,10,19,12],[39,2,39,4],[39,5,39,6],[39,10,39,12],[16,2,16,4],[16,5,16,6],[16,7,16,9],[16,10,16,12],[17,2,17,4],[17,5,17,6],[17,7,17,9],[17,10,17,12],[18,2,18,4],[18,5,18,6],[18,7,18,9],[18,10,18,12],[19,2,19,4],[37,2,37,4],[37,5,37,6],[37,10,37,12],[38,2,38,4],[38,5,38,6]]}
["Use this worksheet to calculate state and local real estate excise tax (REET) per county, when the sale includes parcels in two or more location codes. Include all the parcels within the entire transaction on this worksheet.\n\nONLY use this worksheet if the predominant use for the sale is agriculture or timber land. For assistance in determining predominant use, see ETA 3215.2019 - Graduated Real Estate Excise Tax (REET): Land Classifications & Predominant Use.  If the transfer involves multiple parcels with different classifications, the Predominate Use worksheet must be completed first."]
["Step 1: Calculate the taxable selling price for entire transaction"]
["Gross Selling Price"]
["Personal Property (deduct)"]
["Exemption Claimed (deduct)"]
["Total Taxable Selling Price (A)",null,null,null,{"$f":"IF((E3-E4-E5)<0, \"ERROR\",(E3-E4-E5))","v":0}]
["Step 2: Calculate the total state REET tax"]
["Amount * Rate = Tax due"]
[null,null,null,null,null,null,null,"Amount",null,null,null,"Rate","Tax Due"]
["Taxable sale price",null,null,null,null,null,null,{"$f":"E6","v":0},null,null,null,1.2800000000000001E-2,{"$f":"IF(H10=\" \",\" \",(H10*L10))","v":0}]
["Total State REET Tax (B)",null,null,null,null,null,null,null,null,null,null,null,{"$f":"SUM(M10:O10)","v":0}]
["Step 3: Calculate the state REET tax and local REET tax per parcel"]
["Begin by listing the parcel number and taxable selling price for each. Then fill out the table from left to right for each parcel."]
["Parcel number","Taxable Selling\nPrice for this\nParcel\n\n(C)","Percentage of Sale for this Parcel\n\n(D)\n\nDivide the taxable selling price per parcel by the total taxable selling price\n\nC / A",null,null,"State REET Tax\n\nMultiply the total state REET by the percentage of sale for this parcel\n\n\n\n\nB * D",null,"Location\nCode",null,null,"County Where Parcel is Located",null,null,"Local Rate\n\n(E)","Local REET Tax\n\n\n\n\n\n\n\n\n\nC * E"]
[null,null,{"$f":"IF($E$6=0,\" \",IF(B15=\" \", \" \",B15/$E$6))","v":" "},null,null,{"$f":"IF(B15>0,C15*$M$11,\" \")","v":" "},null,null,null,null,{"$f":"IF(H15=\"\",\"\",VLOOKUP(H15,'Local Tax Rate-Hide'!$A$1:$E$327,5))","v":""},null,null,{"$f":"IF(H15=\"\",\"0\",VLOOKUP(H15,'Local Tax Rate-Hide'!$A$1:$E$327,2))","v":"0"},{"$f":"B15*N15","v":0}]
[null,null,{"$f":"IF($E$6=0,\" \",IF(B16=\" \", \" \",B16/$E$6))","v":" "},null,null,{"$f":"IF(B16>0,C16*$M$11,\" \")","v":" "},null,null,null,null,{"$f":"IF(H16=\"\",\"\",VLOOKUP(H16,'Local Tax Rate-Hide'!$A$1:$E$327,5))","v":""},null,null,{"$f":"IF(H16=\"\",\"0\",VLOOKUP(H16,'Local Tax Rate-Hide'!$A$1:$E$327,2))","v":"0"},{"$f":"B16*N16","v":0}]
[null,null,{"$f":"IF($E$6=0,\" \",IF(B17=\" \", \" \",B17/$E$6))","v":" "},null,null,{"$f":"IF(B17>0,C17*$M$11,\" \")","v":" "},null,null,null,null,{"$f":"IF(H17=\"\",\"\",VLOOKUP(H17,'Local Tax Rate-Hide'!$A$1:$E$327,5))","v":""},null,null,{"$f":"IF(H17=\"\",\"0\",VLOOKUP(H17,'Local Tax Rate-Hide'!$A$1:$E$327,2))","v":"0"},{"$f":"B17*N17","v":0}]
[null,null," ",null,null," ",null,null,null,null,{"$f":"IF(H18=\"\",\"\",VLOOKUP(H18,'Local Tax Rate-Hide'!$A$1:$E$327,5))","v":""},null,null,{"$f":"IF(H18=\"\",\"0\",VLOOKUP(H18,'Local Tax Rate-Hide'!$A$1:$E$327,2))","v":"0"},0]
[null,null," ",null,null," ",null,null,null,null,{"$f":"IF(H19=\"\",\"\",VLOOKUP(H19,'Local Tax Rate-Hide'!$A$1:$E$327,5))","v":""},null,null,{"$f":"IF(H19=\"\",\"0\",VLOOKUP(H19,'Local Tax Rate-Hide'!$A$1:$E$327,2))","v":"0"},0]
[null,null," ",null,null," ",null,null,null,null,{"$f":"IF(H20=\"\",\"\",VLOOKUP(H20,'Local Tax Rate-Hide'!$A$1:$E$327,5))","v":""},null,null,{"$f":"IF(H20=\"\",\"0\",VLOOKUP(H20,'Local Tax Rate-Hide'!$A$1:$E$327,2))","v":"0"},0]
[null,null," ",null,null," ",null,null,null,null,{"$f":"IF(H21=\"\",\"\",VLOOKUP(H21,'Local Tax Rate-Hide'!$A$1:$E$327,5))","v":""},null,null,{"$f":"IF(H21=\"\",\"0\",VLOOKUP(H21,'Local Tax Rate-Hide'!$A$1:$E$327,2))","v":"0"},{"$f":"B21*N21","v":0}]
[null,null,{"$f":"IF($E$6=0,\" \",IF(B22=\" \", \" \",B22/$E$6))","v":" "},null,null,{"$f":"IF(B22>0,C22*$M$11,\" \")","v":" "},null,null,null,null,{"$f":"IF(H22=\"\",\"\",VLOOKUP(H22,'Local Tax Rate-Hide'!$A$1:$E$327,5))","v":""},null,null,{"$f":"IF(H22=\"\",\"0\",VLOOKUP(H22,'Local Tax Rate-Hide'!$A$1:$E$327,2))","v":"0"},{"$f":"B22*N22","v":0}]
[null,null," ",null,null," ",null,null,null,null,{"$f":"IF(H23=\"\",\"\",VLOOKUP(H23,'Local Tax Rate-Hide'!$A$1:$E$327,5))","v":""},null,null,{"$f":"IF(H23=\"\",\"0\",VLOOKUP(H23,'Local Tax Rate-Hide'!$A$1:$E$327,2))","v":"0"},0]
[null,null," ",null,null," ",null,null,null,null,{"$f":"IF(H24=\"\",\"\",VLOOKUP(H24,'Local Tax Rate-Hide'!$A$1:$E$327,5))","v":""},null,null,{"$f":"IF(H24=\"\",\"0\",VLOOKUP(H24,'Local Tax Rate-Hide'!$A$1:$E$327,2))","v":"0"},0]
[null,null," ",null,null," ",null,null,null,null,{"$f":"IF(H25=\"\",\"\",VLOOKUP(H25,'Local Tax Rate-Hide'!$A$1:$E$327,5))","v":""},null,null,{"$f":"IF(H25=\"\",\"0\",VLOOKUP(H25,'Local Tax Rate-Hide'!$A$1:$E$327,2))","v":"0"},0]
[null,null," ",null,null," ",null,null,null,null,{"$f":"IF(H26=\"\",\"\",VLOOKUP(H26,'Local Tax Rate-Hide'!$A$1:$E$327,5))","v":""},null,null,{"$f":"IF(H26=\"\",\"0\",VLOOKUP(H26,'Local Tax Rate-Hide'!$A$1:$E$327,2))","v":"0"},0]
[null,null," ",null,null," ",null,null,null,null,{"$f":"IF(H27=\"\",\"\",VLOOKUP(H27,'Local Tax Rate-Hide'!$A$1:$E$327,5))","v":""},null,null,{"$f":"IF(H27=\"\",\"0\",VLOOKUP(H27,'Local Tax Rate-Hide'!$A$1:$E$327,2))","v":"0"},0]
[null,null," ",null,null," ",null,null,null,null,{"$f":"IF(H28=\"\",\"\",VLOOKUP(H28,'Local Tax Rate-Hide'!$A$1:$E$327,5))","v":""},null,null,{"$f":"IF(H28=\"\",\"0\",VLOOKUP(H28,'Local Tax Rate-Hide'!$A$1:$E$327,2))","v":"0"},{"$f":"B28*N28","v":0}]
[null,null," ",null,null," ",null,null,null,null,{"$f":"IF(H29=\"\",\"\",VLOOKUP(H29,'Local Tax Rate-Hide'!$A$1:$E$327,5))","v":""},null,null,{"$f":"IF(H29=\"\",\"0\",VLOOKUP(H29,'Local Tax Rate-Hide'!$A$1:$E$327,2))","v":"0"},0]
[null,null," ",null,null," ",null,null,null,null,{"$f":"IF(H30=\"\",\"\",VLOOKUP(H30,'Local Tax Rate-Hide'!$A$1:$E$327,5))","v":""},null,null,{"$f":"IF(H30=\"\",\"0\",VLOOKUP(H30,'Local Tax Rate-Hide'!$A$1:$E$327,2))","v":"0"},0]
[null,null," ",null,null," ",null,null,null,null,{"$f":"IF(H31=\"\",\"\",VLOOKUP(H31,'Local Tax Rate-Hide'!$A$1:$E$327,5))","v":""},null,null,{"$f":"IF(H31=\"\",\"0\",VLOOKUP(H31,'Local Tax Rate-Hide'!$A$1:$E$327,2))","v":"0"},0]
[null,null," ",null,null," ",null,null,null,null,{"$f":"IF(H32=\"\",\"\",VLOOKUP(H32,'Local Tax Rate-Hide'!$A$1:$E$327,5))","v":""},null,null,{"$f":"IF(H32=\"\",\"0\",VLOOKUP(H32,'Local Tax Rate-Hide'!$A$1:$E$327,2))","v":"0"},0]
[null,null," ",null,null," ",null,null,null,null,{"$f":"IF(H33=\"\",\"\",VLOOKUP(H33,'Local Tax Rate-Hide'!$A$1:$E$327,5))","v":""},null,null,{"$f":"IF(H33=\"\",\"0\",VLOOKUP(H33,'Local Tax Rate-Hide'!$A$1:$E$327,2))","v":"0"},0]
[null,null," ",null,null," ",null,null,null,null,{"$f":"IF(H34=\"\",\"\",VLOOKUP(H34,'Local Tax Rate-Hide'!$A$1:$E$327,5))","v":""},null,null,{"$f":"IF(H34=\"\",\"0\",VLOOKUP(H34,'Local Tax Rate-Hide'!$A$1:$E$327,2))","v":"0"},0]
[null,null," ",null,null," ",null,null,null,null,{"$f":"IF(H35=\"\",\"\",VLOOKUP(H35,'Local Tax Rate-Hide'!$A$1:$E$327,5))","v":""},null,null,{"$f":"IF(H35=\"\",\"0\",VLOOKUP(H35,'Local Tax Rate-Hide'!$A$1:$E$327,2))","v":"0"},0]
[null,null," ",null,null," ",null,null,null,null,{"$f":"IF(H36=\"\",\"\",VLOOKUP(H36,'Local Tax Rate-Hide'!$A$1:$E$327,5))","v":""},null,null,{"$f":"IF(H36=\"\",\"0\",VLOOKUP(H36,'Local Tax Rate-Hide'!$A$1:$E$327,2))","v":"0"},0]
[null,null," ",null,null," ",null,null,null,null,{"$f":"IF(H37=\"\",\"\",VLOOKUP(H37,'Local Tax Rate-Hide'!$A$1:$E$327,5))","v":""},null,null,{"$f":"IF(H37=\"\",\"0\",VLOOKUP(H37,'Local Tax Rate-Hide'!$A$1:$E$327,2))","v":"0"},0]
[null,null," ",null,null," ",null,null,null,null,{"$f":"IF(H38=\"\",\"\",VLOOKUP(H38,'Local Tax Rate-Hide'!$A$1:$E$327,5))","v":""},null,null,{"$f":"IF(H38=\"\",\"0\",VLOOKUP(H38,'Local Tax Rate-Hide'!$A$1:$E$327,2))","v":"0"},0]
[null,null," ",null,null," ",null,null,null,null,{"$f":"IF(H39=\"\",\"\",VLOOKUP(H39,'Local Tax Rate-Hide'!$A$1:$E$327,5))","v":""},null,null,{"$f":"IF(H39=\"\",\"0\",VLOOKUP(H39,'Local Tax Rate-Hide'!$A$1:$E$327,2))","v":"0"},0]
[null,null," ",null,null," ",null,null,null,null,{"$f":"IF(H40=\"\",\"\",VLOOKUP(H40,'Local Tax Rate-Hide'!$A$1:$E$327,5))","v":""},null,null,{"$f":"IF(H40=\"\",\"0\",VLOOKUP(H40,'Local Tax Rate-Hide'!$A$1:$E$327,2))","v":"0"},0]
{"$rows_left_out":85}
{"sheet":"Local Tax Rate-Hide","index":2,"n_rows":329,"n_cols":8,"rows_kept":329,"cut":false,"hidden":true,"merged":[]}
["Code and Location","RATE","CODE","Location","County"]
["0100 - Adams County",2.5000000000000001E-3,100,"Adams County","Adams"]
["0101 - Hatton",2.5000000000000001E-3,101,"Hatton","Adams",null,null,"County"]
["0102 - Lind",2.5000000000000001E-3,102,"Lind","Adams",null,null,"Adams"]
["0103 - Othello",2.5000000000000001E-3,103,"Othello","Adams",null,null,"Asotin"]
["0104 - Ritzville",2.5000000000000001E-3,104,"Ritzville","Adams",null,null,"Benton"]
["0105 - Washtucna",2.5000000000000001E-3,105,"Washtucna","Adams",null,null,"Chelan"]
["0200 - Asotin County",2.5000000000000001E-3,200,"Asotin County","Asotin",null,null,"Clallam"]
["0201 - Asotin City",2.5000000000000001E-3,201,"Asotin City","Asotin",null,null,"Clark"]
["0202 - Clarkston",2.5000000000000001E-3,202,"Clarkston","Asotin",null,null,"Columbia"]
["0300 - Benton County",2.5000000000000001E-3,300,"Benton County","Benton",null,null,"Cowlitz"]
["0301 - Benton City",5.0000000000000001E-3,301,"Benton City","Benton",null,null,"Douglas"]
["0302 - Kennewick",5.0000000000000001E-3,302,"Kennewick","Benton",null,null,"Ferry"]
["0303 - Prosser",5.0000000000000001E-3,303,"Prosser","Benton",null,null,"Franklin"]
["0304 - Richland",5.0000000000000001E-3,304,"Richland","Benton",null,null,"Garfield"]
["0305 - West Richland",5.0000000000000001E-3,305,"West Richland","Benton",null,null,"Grant"]
["0400 - Chelan County",5.0000000000000001E-3,400,"Chelan County","Chelan",null,null,"Grays Harbor"]
["0401 - Cashmere",2.5000000000000001E-3,401,"Cashmere","Chelan",null,null,"Island"]
["0402 - Chelan City",5.0000000000000001E-3,402,"Chelan City","Chelan",null,null,"Jefferson"]
["0403 - Entiat",2.5000000000000001E-3,403,"Entiat","Chelan",null,null,"King"]
["0404 - Leavenworth",5.0000000000000001E-3,404,"Leavenworth","Chelan",null,null,"Kitsap"]
["0405 - Wenatchee",5.0000000000000001E-3,405,"Wenatchee","Chelan",null,null,"Kittitas"]
["0500 - Clallam County",5.0000000000000001E-3,500,"Clallam County","Clallam",null,null,"Klickitat"]
["0501 - Forks",2.5000000000000001E-3,501,"Forks","Clallam",null,null,"Lewis"]
["0502 - Port Angeles",5.0000000000000001E-3,502,"Port Angeles","Clallam",null,null,"Lincoln"]
["0503 - Sequim",5.0000000000000001E-3,503,"Sequim","Clallam",null,null,"Mason"]
["0600 - Clark County",5.0000000000000001E-3,600,"Clark County","Clark",null,null,"Okanogan"]
["0601 - Battle Ground",5.0000000000000001E-3,601,"Battle Ground","Clark",null,null,"Pacific"]
["0602 - Camas",5.0000000000000001E-3,602,"Camas","Clark",null,null,"Pend Oreille"]
["0603 - La Center",5.0000000000000001E-3,603,"La Center","Clark",null,null,"Pierce"]
["0604 - Ridgefield",5.0000000000000001E-3,604,"Ridgefield","Clark",null,null,"San Juan"]
["0605 - Vancouver",5.0000000000000001E-3,605,"Vancouver","Clark",null,null,"Skagit"]
["0606 - Washougal",5.0000000000000001E-3,606,"Washougal","Clark",null,null,"Skamania"]
["0607 - Yacolt",2.5000000000000001E-3,607,"Yacolt","Clark",null,null,"Snohomish"]
["0700 - Columbia County",5.0000000000000001E-3,700,"Columbia County","Columbia",null,null,"Spokane"]
["0701 - Dayton",2.5000000000000001E-3,701,"Dayton","Columbia",null,null,"Stevens"]
["0702 - Starbuck",0,702,"Starbuck","Columbia",null,null,"Thurston"]
["0800 - Cowlitz County",2.5000000000000001E-3,800,"Cowlitz County","Cowlitz",null,null,"Wahkiakum"]
["0801 - Castle Rock",2.5000000000000001E-3,801,"Castle Rock","Cowlitz",null,null,"Walla Walla"]
["0802 - Kalama",2.5000000000000001E-3,802,"Kalama","Cowlitz",null,null,"Whatcom"]
{"$rows_left_out":289}